p-Cymene-2,5-diol

Normal alkane RI, non-polar column, custom temperature program

Data compiled by: NIST Mass Spectrometry Data Center, William E. Wallace, director

Column type CapillaryCapillary
Active phase Siloxane, 5 % PhPolydimethyl siloxane, 5 % phenyl
Column length (m)
Carrier gas
Substrate
Column diameter (mm)
Phase thickness (μm)
Program not specifiednot specified
I 1571.1571.
ReferenceVOC BinBase, 2012Skogerson, Wohlgemuth, et al., 2011
Comment MSDC-RI MSDC-RI

Van Den Dool and Kratz RI, polar column, custom temperature program

Data compiled by: NIST Mass Spectrometry Data Center, William E. Wallace, director

Column type Capillary
Active phase Stabilwax
Column length (m)
Carrier gas He
Substrate
Column diameter (mm)
Phase thickness (μm)
Program 50C(8min) => 4C/min => 180C(10min) => 5C/min => 220C
I 2180.
ReferenceHudaib, Speroni, et al., 2002
Comment MSDC-RI

Van Den Dool and Kratz RI, non-polar column, custom temperature program

Data compiled by: NIST Mass Spectrometry Data Center, William E. Wallace, director

Column type Capillary
Active phase HP-5MS
Column length (m) 30.
Carrier gas He
Substrate
Column diameter (mm) 0.25
Phase thickness (μm) 0.25
Program 60C (1 min) => 5 C/min => 210C => 10 C/min => 280C (15 min)
I 1554.7
ReferenceAndriamaharavo, 2014
Comment MSDC-RI

References

VOC BinBase, 2012
VOC BinBase, The volatile compound BinBase (VOC BinBase), 2012, retrieved from http://fiehnlab.ucdavis.edu/projects/VocBinBase and http://binbase.sourceforge.net. [all data]

Skogerson, Wohlgemuth, et al., 2011
Skogerson, K.; Wohlgemuth, G.; Fiehn, O., VocBinNase, 2011, retrieved from http://fiehnlab.ucdavis.edu/projects//VocBinBase. [all data]