5,8,11-Heptadecatrienoic acid, methyl ester

Van Den Dool and Kratz RI, polar column, temperature ramp

Data compiled by: NIST Mass Spectrometry Data Center, William E. Wallace, director

Column type Capillary
Active phase Supelcowax-10
Column length (m) 60.
Carrier gas
Substrate
Column diameter (mm) 0.25
Phase thickness (μm) 0.25
Tstart (C) 35.
Tend (C) 195.
Heat rate (K/min) 6.
Initial hold (min) 5.
Final hold (min) 60.
I 2525.
ReferenceChung, Fung, et al., 2005
Comment MSDC-RI

References

Chung, Fung, et al., 2005
Chung, H.Y.; Fung, P.K.; Kim, J.-S., Aroma impact components in commercial plain sufu, J. Agric. Food Chem., 2005, 53, 5, 1684-1691, https://doi.org/10.1021/jf048617d . [all data]