1-Methoxy-3-methyl-2-butene

Normal alkane RI, non-polar column, custom temperature program

Data compiled by: NIST Mass Spectrometry Data Center, William E. Wallace, director

Column type Capillary
Active phase HP-1
Column length (m) 50.
Carrier gas He
Substrate
Column diameter (mm) 0.2
Phase thickness (μm) 0.33
Program 40C(2min) => 2C/min => 200C => 15C/min => 250C (30min)
I 676.
ReferenceBarra, Baldovini, et al., 2007
Comment MSDC-RI

References

Barra, Baldovini, et al., 2007
Barra, A.; Baldovini, N.; Loiseau, A.-M.; Albino, L.; Lesecq, C.; Cuvelier, L.L., Chemical analysis of French beans (Phaseolus vulgaris L.) by headspace solid phase microextraction (HS-SPME) and simultaneous distillation/extraction (SDE), Food Chem., 2007, 101, 3, 1279-1284, https://doi.org/10.1016/j.foodchem.2005.12.027 . [all data]