2-Ethoxy-4,4,5,5-tetramethyl-1,3-dioxolane

Condensed phase thermochemistry data

Data compiled by: Hussein Y. Afeefy, Joel F. Liebman, and Stephen E. Stein

Quantity Value Units Method Reference Comment
Δfliquid-727.5 ± 8.4kJ/molCmGuthrie, 1977Hydrolysis

References

Guthrie, 1977
Guthrie, J.P., Cyclization of glycol monoesters to give hemiorthoesters: a test of the thermochemical method for determining free energies of tetrahedral intermediates, Can. J. Chem., 1977, 55, 3562-3574. [all data]