1,2,3-Triaminoguanidine

Condensed phase thermochemistry data

Data compiled by: Hussein Y. Afeefy, Joel F. Liebman, and Stephen E. Stein

Quantity Value Units Method Reference Comment
Δfsolid72.09kJ/molCcrBaroody and Carpenter, 1976

References

Baroody and Carpenter, 1976
Baroody, E.E.; Carpenter, G.A., Heats of formation of propellant compounds (U), Rpt. NCWC/WOL-TR-76-77 by Naval Surface Weapons Center, Silver Spring, MD, 1976, 1-20. [all data]