1-Propanamine, N-(1-methylethyl)-

Reaction thermochemistry data

Data compiled by: Hussein Y. Afeefy, Joel F. Liebman, and Stephen E. Stein

Individual Reactions

Hydrogen + Isobutyraldehyde ethylimine = 1-Propanamine, N-(1-methylethyl)-

By formula: H2 + C6H13N = C6H15N

Quantity Value Units Method Reference Comment
Δr87. ± 1.kJ/molChydJackman and Packham, 1957liquid phase; solvent: bis-2-Ethoxyethyl ether

Kovats' RI, non-polar column, isothermal

Data compiled by: NIST Mass Spectrometry Data Center, William E. Wallace, director

Column type Packed
Active phase Apiezon L
Column length (m) 2.7
Carrier gas N2
Substrate Chromosorb GAW
Column diameter (mm)
Phase thickness (μm)
Temperature (C) 100.
I 694.
ReferenceGolovnya, Zhuravleva, et al., 1981
Comment MSDC-RI

References

Jackman and Packham, 1957
Jackman, L.M.; Packham, D.I., The experimental resonance energy of acridine, Proc. Chem. Soc., London, 1957, 349-350. [all data]