3-Ethyl-3-(chloromethyl)-oxetane

Phase change data

Data compiled as indicated in comments:
ALS - Hussein Y. Afeefy, Joel F. Liebman, and Stephen E. Stein
AC - William E. Acree, Jr., James S. Chickos

Quantity Value Units Method Reference Comment
Δvap49.71kJ/molN/AMajer and Svoboda, 1985
Δvap49.71 ± 0.15kJ/molCRingner, Sunner, et al., 1971ALS
Δvap49.7 ± 0.2kJ/molCRingner, Sunner, et al., 1971AC

References

Majer and Svoboda, 1985
Majer, V.; Svoboda, V., Enthalpies of Vaporization of Organic Compounds: A Critical Review and Data Compilation, Blackwell Scientific Publications, Oxford, 1985, 300. [all data]

Ringner, Sunner, et al., 1971
Ringner, B.; Sunner, S.; Watanabe, H., The enthalpies of combustion and formation of some 3,3-disubstituted oxetanes, Acta Chem. Scand., 1971, 25, 141-146. [all data]