(2S,3S,6S)-6-Isopropyl-3-methyl-2-(prop-1-en-2-yl)-3-vinylcyclohexanone

Normal alkane RI, polar column, temperature ramp

Data compiled by: NIST Mass Spectrometry Data Center, William E. Wallace, director

Column type CapillaryCapillary
Active phase RTX-WaxRTX-Wax
Column length (m) 60.60.
Carrier gas HeliumHe
Substrate
Column diameter (mm) 0.220.22
Phase thickness (μm) 0.250.25
Tstart (C) 60.60.
Tend (C) 230.230.
Heat rate (K/min) 2.2.
Initial hold (min)
Final hold (min) 5.35.
I 1897.1890.
ReferenceBendiabdellah, El Amine Dib, et al., 2012Paolini, Tomi, et al., 2008
Comment MSDC-RI MSDC-RI

References

Bendiabdellah, El Amine Dib, et al., 2012
Bendiabdellah, A.; El Amine Dib, M.; Djabou, N.; Allali, H.; Tabti, B.; Costa, J.; Myseli, A., Biological activities and volatile cinstituents of Daucus muricatus L. from Algeria, Chem. Centr. J., 2012, 6, 48, 1-22. [all data]

Paolini, Tomi, et al., 2008
Paolini, J.; Tomi, P.; Bernardini, A.-F.; Bradesi, P.; Casanova, J.; Kaloustian, J., Detailed analysis of the essential oil from Cistus albidus L. by combination of GC/RI, GC/MS and 13C-NMR spectroscopy, N.Z. J. Agric. Res., 2008, 22, 14, 1270-1278. [all data]