4-hexylbenzoic acid

Phase change data

Data compiled as indicated in comments:
TRC - Thermodynamics Research Center, NIST Boulder Laboratories, Chris Muzny director
AC - William E. Acree, Jr., James S. Chickos
CAL - James S. Chickos, William E. Acree, Jr., Joel F. Liebman, Students of Chem 202 (Introduction to the Literature of Chemistry), University of Missouri -- St. Louis

Quantity Value Units Method Reference Comment
Tfus371.0KN/APrivalko, Puchkovskaya, et al., 1985Smectic liquid crystal phase; Uncertainty assigned by TRC = 0.1 K; TRC
Quantity Value Units Method Reference Comment
Δsub123.6 ± 1.0kJ/molMEMonte, Almeida, et al., 2004Based on data from 347. - 363. K.; AC

Entropy of fusion

ΔfusS (J/mol*K) Temperature (K) Reference Comment
46.90371.0Privalko, Puchkovskaya, et al., 1985CAL
6.31380.0

In addition to the Thermodynamics Research Center (TRC) data available from this site, much more physical and chemical property data is available from the following TRC products:

References

Privalko, Puchkovskaya, et al., 1985
Privalko, V.P.; Puchkovskaya, G.A.; Shermatov, E.N.; Yakubov, A.A., Polymorphic Transitions in Alkylbenzoic Acids, Mol. Cryst. Liq. Cryst., 1985, 126, 2-4, 289, https://doi.org/10.1080/00268948508084797 . [all data]

Monte, Almeida, et al., 2004
Monte, Manuel J.S.; Almeida, Ana R.R.P.; Ribeiro da Silva, Manuel A.V., Thermodynamic study of the sublimation of eight 4-n-alkylbenzoic acids, The Journal of Chemical Thermodynamics, 2004, 36, 5, 385-392, https://doi.org/10.1016/j.jct.2004.02.001 . [all data]