Hexane, 1,2-dichloro-

Kovats' RI, non-polar column, isothermal

View large format table.

Column type Active phase Temperature (C) I Reference Comment
CapillaryApiezon L90.1005.Morishita, Terashima, et al., 1983He; Column length: 45. m; Column diameter: 0.25 mm

Kovats' RI, polar column, isothermal

View large format table.

Column type Active phase Temperature (C) I Reference Comment
CapillaryPEG-20M90.1311.Morishita, Terashima, et al., 1983He; Column length: 75. m; Column diameter: 0.25 mm

Normal alkane RI, non-polar column, isothermal

View large format table.

Column type Active phase Temperature (C) I Reference Comment
CapillaryApiezon L130.1005.Arruda, Junkes, et al., 2008

Normal alkane RI, non-polar column, temperature ramp

View large format table.

Column type Active phase I Reference Comment
CapillaryOV-101980.Zenkevich, Eliseenkov, et al., 201125. m/0.20 mm/0.25 μm, Nitrogen, 6. K/min; Tstart: 40. C; Tend: 220. C

References

Morishita, Terashima, et al., 1983
Morishita, F.; Terashima, Y.; Ichise, M.; Kojima, T., Prediction of retention indices from molecular structures of chlorinated alkanes, J. Chromatogr. Sci., 1983, 21, 5, 209-213, https://doi.org/10.1093/chromsci/21.5.209 . [all data]

Arruda, Junkes, et al., 2008
Arruda, A.C.S.; Junkes, B. da.S.; Souza, E.S.; Yunes, R.A.; Heizen, V.E.F., Semi-Emlirical Topological Index to Predict Properties of Halogenated Aliphatic Compounds, J. Chemometrics, 2008, 22, 3-4, 186-194, https://doi.org/10.1002/cem.1121 . [all data]

Zenkevich, Eliseenkov, et al., 2011
Zenkevich, I.G.; Eliseenkov, E.V.; Kasatochkin, A.N.; Ukolov, A.I., Identification of the products of nonregioselective organic reactions by chromatography - mass spectrometry: chloro derivatives of dialkyl ethers, Rus. J. Anal. Chem., 2011, 66, 14, 1445-1454, https://doi.org/10.1134/S1061934811140218 . [all data]