2,5-Cyclohexadiene-1,4-dione,5-[(2-hydroxyethyl)methylamino]-2,3-dimethyl-

Reaction thermochemistry data

Data compiled by: Hussein Y. Afeefy, Joel F. Liebman, and Stephen E. Stein

Individual Reactions

2,5-Cyclohexadiene-1,4-dione,5-[(2-hydroxyethyl)methylamino]-2,3-dimethyl- = 2H-1,4Benzoxazin-6(8aH)-one, 3,4-dihydro-8a-hydroxy-4,7,8-trimethyl

By formula: C11H15NO3 = C11H15NO3

Quantity Value Units Method Reference Comment
Δr-16.kJ/molEqkJancke, Radeglia, et al., 1977liquid phase; solvent: CHCl3; NMR

References

Jancke, Radeglia, et al., 1977
Jancke, H.; Radeglia, R.; Tresselt, D.; Berg, H., Carbon-13 NMR spectroscopic study of the thermochromism of substituted 2-amino-1,4-benzoquinones, Z. Chem., 1977, 17, 105-106. [all data]