1-Octyl urea

Phase change data

Data compiled by: William E. Acree, Jr., James S. Chickos

Enthalpy of fusion

ΔfusH (kcal/mol) Temperature (K) Method Reference
5.83374.6DSCHashimoto, Tajima, et al., 2005
5.88372.2N/AWells and Drummond, 1999

References

Hashimoto, Tajima, et al., 2005
Hashimoto, Masao; Tajima, Fukue; Eda, Kazuo; Yamamura, Kimiaki; Okazaki, Tadashi, Exploration of plastic-like phases in alkylurea systems. A thermal and X-ray study, Journal of Molecular Structure, 2005, 734, 1-3, 23-33, https://doi.org/10.1016/j.molstruc.2004.08.008 . [all data]

Wells and Drummond, 1999
Wells, Darrell; Drummond, Calum J., Nonionic n -Hexyl, n -Heptyl, and n -Octyl Urea Surfactants: Some Physicochemical Properties, Langmuir, 1999, 15, 14, 4713-4721, https://doi.org/10.1021/la981542l . [all data]