Aziridine, TMS derivative

Phase change data

Data compiled by: William E. Acree, Jr., James S. Chickos

Enthalpy of fusion

ΔfusH (kJ/mol) Temperature (K) Reference
10.5192.5Kulagina and Lebedev, 1999

References

Kulagina and Lebedev, 1999
Kulagina, T.G.; Lebedev, B.V., The thermodynamic functions of trimethylsilylethyleneimine in the temperature range 0-310 K, Zh. Fiz. Khim., 1999, 73, 12, 2119. [all data]