Lycoramine

Van Den Dool and Kratz RI, non-polar column, custom temperature program

View large format table.

Column type Active phase I Reference Comment
CapillaryHP-5MS2423.3Andriamaharavo, 201430. m/0.25 mm/0.25 μm, He; Program: 60C (1 min) => 5 C/min => 210C => 10 C/min => 280C (15 min)

Normal alkane RI, non-polar column, temperature ramp

View large format table.

Column type Active phase I Reference Comment
CapillaryRTX-5 MS2365.Gotti, Fiori, et al., 200630. m/0.25 mm/0.25 μm, He, 10. K/min, 280. C @ 10. min; Tstart: 80. C

References

Andriamaharavo, 2014
Andriamaharavo, N.R., Retention Data. NIST Mass Spectrometry Data Center., NIST Mass Spectrometry Data Center, 2014. [all data]

Gotti, Fiori, et al., 2006
Gotti, R.; Fiori, J.; Bartolini, M.; Cavrini, V., Analysis of Amaryllidaceae alkaloids from Narcissus by GC-MS and capillary electrophoresis, J. Pharm. Biomed. Anal., 2006, 42, 1, 17-24, https://doi.org/10.1016/j.jpba.2006.01.003 . [all data]