1H-1,2,4-Triazole, 3-azido-5-methyl-

Condensed phase thermochemistry data

Data compiled by: Hussein Y. Afeefy, Joel F. Liebman, and Stephen E. Stein

Quantity Value Units Method Reference Comment
Δfsolid392.6 ± 5.1kJ/molCcbDenault, Marx, et al., 1968Heat of combustion calculated. author's E=-513.80 kcal/mol
Quantity Value Units Method Reference Comment
Δcsolid-2144.8kJ/molCcbDenault, Marx, et al., 1968Heat of combustion calculated. author's E=-513.80 kcal/mol

References

Denault, Marx, et al., 1968
Denault, G.C.; Marx, P.C.; Takimoto, H.H., Energy of combustion and differential thermograms of organic azides, J. Chem. Eng. Data, 1968, 13, 514-516. [all data]