3,4-dimethylfuran

Gas phase ion energetics data

Data evaluated by: Edward P. Hunter and Sharon G. Lias

Quantity Value Units Method Reference Comment
Proton affinity (review)869.0kJ/molN/AHunter and Lias, 1998
Quantity Value Units Method Reference Comment
Gas basicity838.3kJ/molN/AHunter and Lias, 1998

Normal alkane RI, non-polar column, temperature ramp

View large format table.

Column type Active phase I Reference Comment
CapillaryDB-1724.Barrefors, Björkqvist, et al., 199650. m/0.32 mm/1. μm, 3. K/min; Tstart: -30. C

References

Hunter and Lias, 1998
Hunter, E.P.; Lias, S.G., Evaluated Gas Phase Basicities and Proton Affinities of Molecules: An Update, J. Phys. Chem. Ref. Data, 1998, 27, 3, 413-656, https://doi.org/10.1063/1.556018 . [all data]