1,1-Ethanediol, 2-phenyl-, diacetate

Condensed phase thermochemistry data

Data compiled by: Hussein Y. Afeefy, Joel F. Liebman, and Stephen E. Stein

Quantity Value Units Method Reference Comment
Δfsolid-794.5 ± 1.2kJ/molCcbVerevkin, Peng, et al., 1996
Quantity Value Units Method Reference Comment
Δcsolid-5928.4 ± 1.2kJ/molCcbVerevkin, Peng, et al., 1996Corresponding Δfsolid = -794.5 kJ/mol (simple calculation by NIST; no Washburn corrections)

References

Verevkin, Peng, et al., 1996
Verevkin, S.P.; Peng, W.-H.; Beckhaus, H.D.; Ruchardt, C., Thermochemical study of aliphatic and phenyl-substituted germinal diacetates, Struct. Chem., 1996, 7, 397-404. [all data]