11-Tetradecen-1-ol, acetate, (Z)-

Normal alkane RI, non-polar column, custom temperature program

Data compiled by: NIST Mass Spectrometry Data Center, William E. Wallace, director

Column type Capillary
Active phase HP-1
Column length (m) 15.
Carrier gas He
Substrate
Column diameter (mm) 0.25
Phase thickness (μm) 0.25
Program 50 0C (1 min) 20 0C/min -> 100 0C 5 0C/min -> 230 0C (5 min)
I 1788.
ReferenceWakamura, Hattori, et al., 1999
Comment MSDC-RI

Normal alkane RI, polar column, custom temperature program

Data compiled by: NIST Mass Spectrometry Data Center, William E. Wallace, director

Column type Capillary
Active phase DB-Wax
Column length (m) 30.
Carrier gas He
Substrate
Column diameter (mm) 0.25
Phase thickness (μm) 0.25
Program 50 0C (1 min) 20 0C/min -> 100 0C 5 0C/min -> 230 0C (5 min)
I 2154.
ReferenceWakamura, Hattori, et al., 1999
Comment MSDC-RI

References

Wakamura, Hattori, et al., 1999
Wakamura, S.; Hattori, M.; Igita, K.; Yasuda, K.; Tridjaka, Sex pheromone of Etiella behrii, a pod borer of soybean in Indonesia: identification and field attraction, Entomol. Exp. Appl., 1999, 91, 3, 413-420, https://doi.org/10.1046/j.1570-7458.1999.00509.x . [all data]