5,6-dimethylquinoline

Phase change data

Data compiled by: Thermodynamics Research Center, NIST Boulder Laboratories, Chris Muzny director

Quantity Value Units Method Reference Comment
Tfus323.KN/AManske, Marion, et al., 1942Uncertainty assigned by TRC = 4. K

In addition to the Thermodynamics Research Center (TRC) data available from this site, much more physical and chemical property data is available from the following TRC products:

References

Manske, Marion, et al., 1942
Manske, R.H.F.; Marion, L.; Leger, F., The synthesis and characterization of the monomethyl and dimethylquinolines, Can. J. Res., Sect. B, 1942, 20, 133-52. [all data]