Nitric acid, hexyl ester

Van Den Dool and Kratz RI, non-polar column, temperature ramp

Data compiled by: NIST Mass Spectrometry Data Center, William E. Wallace, director

Column type Capillary
Active phase 5 % Phenyl methyl siloxane
Column length (m) 30.
Carrier gas He
Substrate
Column diameter (mm) 0.25
Phase thickness (μm) 1.
Tstart (C) 40.
Tend (C) 250.
Heat rate (K/min) 7.
Initial hold (min) 10.
Final hold (min) 5.
I 1043.
ReferenceEstevez, Ventanas, et al., 2005
Comment MSDC-RI

References

Estevez, Ventanas, et al., 2005
Estevez, M.; Ventanas, S.; Ramirez, R.; Cava, R., Influence of the Addition of Rosemary Essential Oil on the Volatiles Pattern of Porcine Frankfurters, J. Agric. Food Chem., 2005, 53, 21, 8317-8324, https://doi.org/10.1021/jf051025q . [all data]