Propanoic acid, 2,2,3,3-tetrachloro-, methyl ester
- Formula: C4H4Cl4O2
- Molecular weight: 225.885
- IUPAC Standard InChIKey: UQYYMXYJSOOLLA-UHFFFAOYSA-N
- CAS Registry Number: 20618-05-7
- Chemical structure:

Kovats' RI, non-polar column, isothermal

Column type | Active phase | Temperature (C) | I | Reference | Comment |
---|---|---|---|---|---|
Capillary | OV-101 | 120. | 1156. | Evans, Haken, et al., 1986 | |
Capillary | OV-101 | 100. | 1157. | Haken and Korhonen, 1984 | N2; Column length: 25. m; Column diameter: 0.3 mm |
Capillary | OV-101 | 120. | 1156. | Haken and Korhonen, 1984 | N2; Column length: 25. m; Column diameter: 0.3 mm |
Capillary | OV-101 | 80. | 1149. | Haken and Korhonen, 1984 | N2; Column length: 25. m; Column diameter: 0.3 mm |

References

Evans, Haken, et al., 1986
Evans, M.B.; Haken, J.K.; Tóth, T.,
Solute characterization in gas chromatography by an extension of Kováts retention index system. Dispersion and selectivity indices,
J. Chromatogr., 1986, 351, 155-164, https://doi.org/10.1016/S0021-9673(01)83484-1
. [all data]
Haken and Korhonen, 1984
Haken, J.K.; Korhonen, I.O.O.,
Gas chromatography of homologous esters. XXIV. Studies of chlorinated methyl propanoates and butanoates on a non-polar capillary column,
J. Chromatogr., 1984, 284, 474-477, https://doi.org/10.1016/S0021-9673(01)87849-3
. [all data]