Perimidine, 2-amino-1-methyl-

Gas phase ion energetics data

Data compiled by: Sharon G. Lias, Rhoda D. Levin, and Sherif A. Kafafi

Ionization energy determinations

IE (eV) Method Reference
6.41CTSPozharskii, Kashparov, et al., 1971

References

Pozharskii, Kashparov, et al., 1971
Pozharskii, A.F.; Kashparov, I.S.; Holls, P.J.; Zaletov, V.G., Hetrocyclic pleiadiene analogs. VI. Electronic properties of perimidine, Chem. Heterocycl. Compd., 1971, 4, 503, In original 543. [all data]