4-Bromo-N,N-diethylaniline

Gas phase ion energetics data

Data compiled by: Henry M. Rosenstock, Keith Draxl, Bruce W. Steiner, and John T. Herron

Ionization energy determinations

IE (eV) Method Reference
6.96CTSFarrell and Newton, 1965

References

Farrell and Newton, 1965
Farrell, P.G.; Newton, J., Ionization potentials of aromatic amines, J. Phys. Chem., 1965, 69, 3506. [all data]