Butanoic acid, 2-propenyl ester

Kovats' RI, non-polar column, isothermal

Data compiled by: NIST Mass Spectrometry Data Center, William E. Wallace, director

Column type CapillaryCapillaryCapillaryCapillaryPacked
Active phase SE-30SE-30SE-30SE-30SE-30
Column length (m) 25.25.25.25.3.7
Carrier gas N2N2N2N2
Substrate     Celite 560 silanized
Column diameter (mm) 0.330.330.330.33
Phase thickness (μm)
Temperature (C) 100.120.140.160.150.
I 884.851.868.894.853.
ReferenceHaken, Madden, et al., 1985Haken, Madden, et al., 1985Haken, Madden, et al., 1985Haken, Madden, et al., 1985Allen and Haken, 1970
Comment MSDC-RI MSDC-RI MSDC-RI MSDC-RI MSDC-RI

Normal alkane RI, non-polar column, temperature ramp

Data compiled by: NIST Mass Spectrometry Data Center, William E. Wallace, director

Column type Capillary
Active phase HP-5
Column length (m) 30.
Carrier gas
Substrate
Column diameter (mm) 0.25
Phase thickness (μm)
Tstart (C) 50.
Tend (C) 200.
Heat rate (K/min) 3.
Initial hold (min)
Final hold (min)
I 883.
ReferenceIsidorov and Jdanova, 2002
Comment MSDC-RI

Kovats' RI, polar column, isothermal

View large format table.

Column type Active phase Temperature (C) I Reference Comment
CapillaryOV-351100.1198.Haken, Madden, et al., 1985N2; Column length: 25. m; Column diameter: 0.32 mm
CapillaryOV-351120.1227.Haken, Madden, et al., 1985N2; Column length: 25. m; Column diameter: 0.32 mm

Van Den Dool and Kratz RI, non-polar column, temperature ramp

View large format table.

Column type Active phase I Reference Comment
CapillaryZB-1866.Herbrand K., Hammerschmidt F.J., et al., 200760. m/0.25 mm/0.25 μm, He, 3. K/min; Tstart: 60. C; Tend: 280. C
CapillarySPB-1865.Larráyoz, Addis, et al., 200130. m/0.32 mm/4. μm, He, 45. C @ 13. min, 5. K/min, 240. C @ 5. min

Van Den Dool and Kratz RI, polar column, temperature ramp

View large format table.

Column type Active phase I Reference Comment
CapillaryZB-Wax1180.Herbrand K., Hammerschmidt F.J., et al., 200760. m/0.32 mm/0.25 μm, He, 3. K/min; Tstart: 60. C; Tend: 240. C
CapillaryCP-Wax 52CB1185.Mahadevan and Farmer, 200660. C @ 5. min, 4. K/min, 220. C @ 30. min; Column length: 50. m; Column diameter: 0.32 mm

Normal alkane RI, non-polar column, custom temperature program

View large format table.

Column type Active phase I Reference Comment
CapillarySE-30867.Vinogradov, 2004Program: not specified
CapillarySF-96861.Kawasaki, Matsui, et al., 1998Column length: 40. m; Column diameter: 0.28 mm; Program: 75C => 3C/min => 190C(25min) => 3C/min => 210C
CapillaryOV-1, SE-30, Methyl silicone, SP-2100, OV-101, DB-1, etc.853.Waggott and Davies, 1984Hydrogen; Column length: 50. m; Column diameter: 0.32 mm; Program: not specified

References

Haken, Madden, et al., 1985
Haken, J.K.; Madden, B.G.; Korhonen, I.O.O., Gas chromatography of homologous esters. XXXI. Butanoyl and monochlorobutanoyl esters of lower saturated branched chain and unsaturated alcohols on SE-30 and OV-351 capillary columns, J. Chromatogr., 1985, 325, 61-73, https://doi.org/10.1016/S0021-9673(00)96008-4 . [all data]

Allen and Haken, 1970
Allen, I.D.; Haken, J.K., Gas chromatography of homologous esters. Part IV. Influence of stationary phase polarity on retention of unsaturated esters, J. Chromatogr., 1970, 51, 415-422, https://doi.org/10.1016/S0021-9673(01)96890-6 . [all data]