Butyric acid, neopentyl ester

Kovats' RI, non-polar column, isothermal

View large format table.

Column type Active phase Temperature (C) I Reference Comment
CapillarySE-30100.963.Haken, Madden, et al., 1985N2; Column length: 25. m; Column diameter: 0.33 mm
CapillarySE-30120.955.Haken, Madden, et al., 1985N2; Column length: 25. m; Column diameter: 0.33 mm
CapillarySE-30140.977.Haken, Madden, et al., 1985N2; Column length: 25. m; Column diameter: 0.33 mm
CapillarySE-3060.977.Haken, Madden, et al., 1985N2; Column length: 25. m; Column diameter: 0.33 mm
CapillarySE-3080.972.Haken, Madden, et al., 1985N2; Column length: 25. m; Column diameter: 0.33 mm

Kovats' RI, polar column, isothermal

View large format table.

Column type Active phase Temperature (C) I Reference Comment
CapillaryOV-351100.1178.Haken, Madden, et al., 1985N2; Column length: 25. m; Column diameter: 0.32 mm
CapillaryOV-35160.1163.Haken, Madden, et al., 1985N2; Column length: 25. m; Column diameter: 0.32 mm
CapillaryOV-35180.1157.Haken, Madden, et al., 1985N2; Column length: 25. m; Column diameter: 0.32 mm

Gas phase thermochemistry data

Data compiled by: Hussein Y. Afeefy, Joel F. Liebman, and Stephen E. Stein

Quantity Value Units Method Reference Comment
Δfgas-574.0 ± 1.1kJ/molCcbVerevkin, Beckhaus, et al., 1996

Condensed phase thermochemistry data

Data compiled by: Hussein Y. Afeefy, Joel F. Liebman, and Stephen E. Stein

Quantity Value Units Method Reference Comment
Δfliquid-624.8 ± 1.0kJ/molCcbVerevkin, Beckhaus, et al., 1996
Quantity Value Units Method Reference Comment
Δcliquid-5489.28 ± 0.98kJ/molCcbVerevkin, Beckhaus, et al., 1996Corresponding Δfliquid = -624.78 kJ/mol (simple calculation by NIST; no Washburn corrections)

References

Haken, Madden, et al., 1985
Haken, J.K.; Madden, B.G.; Korhonen, I.O.O., Gas chromatography of homologous esters. XXXI. Butanoyl and monochlorobutanoyl esters of lower saturated branched chain and unsaturated alcohols on SE-30 and OV-351 capillary columns, J. Chromatogr., 1985, 325, 61-73, https://doi.org/10.1016/S0021-9673(00)96008-4 . [all data]