Phenol, 2-[(phenylimino)methyl]-, N-oxide

Condensed phase thermochemistry data

Data compiled by: Hussein Y. Afeefy, Joel F. Liebman, and Stephen E. Stein

Quantity Value Units Method Reference Comment
Δfsolid-62.6 ± 2.0kJ/molCcbKirchner, Acree, et al., 1986
Quantity Value Units Method Reference Comment
Δcsolid-6625.1 ± 1.1kJ/molCcbKirchner, Acree, et al., 1986

Gas phase thermochemistry data

Data compiled by: Hussein Y. Afeefy, Joel F. Liebman, and Stephen E. Stein

Quantity Value Units Method Reference Comment
Δfgas12.9 ± 0.57kcal/molCcbKirchner, Acree, et al., 1986

References

Kirchner, Acree, et al., 1986
Kirchner, J.J.; Acree, W.E., Jr.; Pilcher, G.; Shaofeng, L., Enthalpies of combustion of four N-phenylmethylene benzenamine N-oxide derivatives, of N-phenylmethylene benzenamine, and of trans-diphenyldiazene N-oxide: the dissociation enthalpy of the (N-O)bonds, J. Chem. Thermodyn., 1986, 18, 793-799. [all data]