1-Hexanamine, N-propyl-

Kovats' RI, non-polar column, isothermal

View large format table.

Column type Active phase Temperature (C) I Reference Comment
PackedApiezon L100.1047.Golovnya, Zhuravleva, et al., 1980N2, Chromosorb GAW; Column length: 2.7 m

References

Golovnya, Zhuravleva, et al., 1980
Golovnya, R.V.; Zhuravleva, N.L.; Svetlova, N.I.; Grigor'eva, D.N., Gas-chromatographic separation of secondary normal alphatic amines, J. Anal. Chem. USSR (Engl. Transl.), 1980, 35, 10, 1280-1285. [all data]