α-Corocalene

Van Den Dool and Kratz RI, non-polar column, temperature ramp

Data compiled by: NIST Mass Spectrometry Data Center, William E. Wallace, director

Column type Capillary
Active phase CP Sil 5 CB
Column length (m) 25.
Carrier gas He
Substrate
Column diameter (mm) 0.25
Phase thickness (μm)
Tstart (C) 60.
Tend (C) 260.
Heat rate (K/min) 5.
Initial hold (min)
Final hold (min)
I 1608.
ReferenceWeyerstahl, Marschall, et al., 1999
Comment MSDC-RI

Van Den Dool and Kratz RI, non-polar column, custom temperature program

Data compiled by: NIST Mass Spectrometry Data Center, William E. Wallace, director

Column type Capillary
Active phase HP-5MS
Column length (m) 30.
Carrier gas He
Substrate
Column diameter (mm) 0.25
Phase thickness (μm) 0.25
Program 60C (1 min) => 5 C/min => 210C => 10 C/min => 280C (15 min)
I 1629.2
ReferenceAndriamaharavo, 2014
Comment MSDC-RI

Normal alkane RI, non-polar column, temperature ramp

Data compiled by: NIST Mass Spectrometry Data Center, William E. Wallace, director

Column type CapillaryCapillary
Active phase HP-5RTX-1
Column length (m) 30.60.
Carrier gas HydrogenHe
Substrate
Column diameter (mm) 0.250.22
Phase thickness (μm) 0.250.25
Tstart (C) 70.60.
Tend (C) 290.230.
Heat rate (K/min) 5.2.
Initial hold (min)
Final hold (min)  35.
I 1630.1605.
ReferenceRadulovic, Dordevic, et al., 2010Paolini, Tomi, et al., 2008
Comment MSDC-RI MSDC-RI

Kovats' RI, non-polar column, temperature ramp

Data compiled by: NIST Mass Spectrometry Data Center, William E. Wallace, director

Column type Capillary
Active phase DB-5
Column length (m) 30.
Carrier gas He
Substrate
Column diameter (mm) 0.26
Phase thickness (μm) 0.25
Tstart (C) 60.
Tend (C) 246.
Heat rate (K/min) 3.
Initial hold (min)
Final hold (min)
I 1623.
ReferenceAdams, Morris, et al., 2005
Comment MSDC-RI

References

Weyerstahl, Marschall, et al., 1999
Weyerstahl, P.; Marschall, H.; Wahlburg, H.-C.; Christiansen, C.; Rustaiyan, A.; Mirdjalili, F., Constituents of the essential oil of Pulicaria gnaphalodes (Vent.) Boiss. from Iran, Flavour Fragr. J., 1999, 14, 2, 121-130, https://doi.org/10.1002/(SICI)1099-1026(199903/04)14:2<121::AID-FFJ790>3.0.CO;2-K . [all data]