cis-7-Dodecen-1-ol

Phase change data

Data compiled by: William E. Acree, Jr., James S. Chickos

Quantity Value Units Method Reference Comment
Δvap90.5kJ/molCGCOva, Koultek, et al., 2000Based on data from 333. - 373. K. See also Koutek, Hoskovec, et al., 1994.

Van Den Dool and Kratz RI, polar column, temperature ramp

Data compiled by: NIST Mass Spectrometry Data Center, William E. Wallace, director

Column type Capillary
Active phase DB-Wax
Column length (m) 30.
Carrier gas
Substrate
Column diameter (mm) 0.32
Phase thickness (μm) 0.25
Tstart (C) 100.
Tend (C) 240.
Heat rate (K/min) 5.
Initial hold (min) 1.
Final hold (min)
I 2009.
ReferenceMarques, McElfresh, et al., 2000
Comment MSDC-RI

References

Ova, Koultek, et al., 2000
Ova, P.V.; Koultek, B.; Hoskovec, M., Practice Oriented Results on Use and Production of Neem Ingredients and Pheromones VI, H. Kleeberg and C.P.W. Zebitz, ed(s)., Druck and Graphic, Giessen, 2000, 211-218. [all data]

Koutek, Hoskovec, et al., 1994
Koutek, Bohumír; Hoskovec, Michal; Vrkocová, Pavlína; Konecný, Karel; Feltl, Ladislav, Gas chromatographic determination of vapour pressures of pheromone-like compounds II. Alcohols, Journal of Chromatography A, 1994, 679, 2, 307-317, https://doi.org/10.1016/0021-9673(94)80573-3 . [all data]