Cycloheptene, 1,2-dimethyl-

Phase change data

Data compiled by: Thermodynamics Research Center, NIST Boulder Laboratories, Chris Muzny director

Quantity Value Units Method Reference Comment
Tboil432.KN/ACriegee, Kerckow, et al., 1955Uncertainty assigned by TRC = 6. K

In addition to the Thermodynamics Research Center (TRC) data available from this site, much more physical and chemical property data is available from the following TRC products:

References

Criegee, Kerckow, et al., 1955
Criegee, R.; Kerckow, A.; Zinke, H., Chem. Ber., 1955, 88, 1878. [all data]