6H-Dibenzo(b,d)pyran-6-one

Lee's RI, non-polar column, custom temperature program

View large format table.

Column type Active phase I Reference Comment
CapillaryDB-5325.87Helmig and Arey, 199260. m/0.25 mm/0.25 μm; Program: 50C(1min) => 25C/min => 150C => 4C/min => 325C

References

Helmig and Arey, 1992
Helmig, D.; Arey, J., Analytical chemistry of four nitrodibenzopyranone isomers for ambient air analysis, Int. J. Environ. Anal. Chem., 1992, 49, 4, 207-219, https://doi.org/10.1080/03067319208027572 . [all data]