Cyclopropane, 1-ethyl-2-methyl-, cis-

Phase change data

Data compiled by: Thermodynamics Research Center, NIST Boulder Laboratories, Chris Muzny director

Quantity Value Units Method Reference Comment
Tboil340.16KN/AKelso, Greenlee, et al., 1955Uncertainty assigned by TRC = 0.3 K
Tboil337.55KN/ALespieau and Wakeman, 1932Uncertainty assigned by TRC = 1.5 K
Tboil338.55KN/ALespieau and Wakeman, 1932Uncertainty assigned by TRC = 1.5 K
Tboil337.55KN/ALespieau and Wakeman, 1931Uncertainty assigned by TRC = 1.5 K
Tboil338.55KN/ALespieau and Wakeman, 1931Uncertainty assigned by TRC = 1.5 K

In addition to the Thermodynamics Research Center (TRC) data available from this site, much more physical and chemical property data is available from the following TRC products:

Kovats' RI, non-polar column, isothermal

Data compiled by: NIST Mass Spectrometry Data Center, William E. Wallace, director

Column type PackedCapillary
Active phase SqualaneSqualane
Column length (m)  100.
Carrier gas
Substrate
Column diameter (mm)  0.25
Phase thickness (μm)
Temperature (C) 20.120.
I 603.603.0
ReferenceBogoslovsky, Anvaer, et al., 1978Schomburg and Dielmann, 1973
Comment MSDC-RI MSDC-RI

References

Kelso, Greenlee, et al., 1955
Kelso, R.G.; Greenlee, K.W.; Derfer, J.M.; Boord, C.E., The Synthesis, Purification and Properties of Some Polyalkylcyclo- propanes: Reduction of α,.gama.-Dibromides, J. Am. Chem. Soc., 1955, 77, 1751-5. [all data]

Lespieau and Wakeman, 1932
Lespieau, R.; Wakeman, R.L., On several cyclopropanic carbides and their general methods of preparation., Bull. Soc. Chim. Fr., 1932, 51, 384. [all data]

Lespieau and Wakeman, 1931
Lespieau, R.; Wakeman, R.L., C. R. Hebd. Seances Acad. Sci., 1931, 192, 1395. [all data]