3-Decanol, 6-ethyl-,

Phase change data

Data compiled by: Thermodynamics Research Center, NIST Boulder Laboratories, Chris Muzny director

Quantity Value Units Method Reference Comment
Tboil498.15KN/AWickert and Freure, 1937Uncertainty assigned by TRC = 4. K

In addition to the Thermodynamics Research Center (TRC) data available from this site, much more physical and chemical property data is available from the following TRC products:

References

Wickert and Freure, 1937
Wickert, J.N.; Freure, B.T., , 1937. [all data]