5-Dodecanone

Phase change data

Data compiled by: Thermodynamics Research Center, NIST Boulder Laboratories, Chris Muzny director

Quantity Value Units Method Reference Comment
Tfus282.85KN/ABaykut and Ozeris, 1956Uncertainty assigned by TRC = 2. K
Quantity Value Units Method Reference Comment
Tc695.2KN/APulliam, Gude, et al., 1995Uncertainty assigned by TRC = 3. K
Quantity Value Units Method Reference Comment
ρc1.32mol/lN/APulliam, Gude, et al., 1995Uncertainty assigned by TRC = 0.04 mol/l

In addition to the Thermodynamics Research Center (TRC) data available from this site, much more physical and chemical property data is available from the following TRC products:

References

Baykut and Ozeris, 1956
Baykut, F.; Ozeris, S., Istanbul Univ. Fen. Fak. Mecm., Ser. C, 1956, 21, 102. [all data]

Pulliam, Gude, et al., 1995
Pulliam, M.K.; Gude, M.T.; Teja, A.S., Critical Temperatures and Densities of n-Alkanones, J. Chem. Eng. Data, 1995, 40, 455-8. [all data]