3-Heptanol, 2,2-dimethyl-

Normal alkane RI, non-polar column, isothermal

Data compiled by: NIST Mass Spectrometry Data Center, William E. Wallace, director

Column type Packed
Active phase SE-30
Column length (m) 1.
Carrier gas
Substrate
Column diameter (mm)
Phase thickness (μm)
Temperature (C) 100.
I 814.
ReferenceZhou and Wu, 2007
Comment MSDC-RI

References

Zhou and Wu, 2007
Zhou, L.; Wu, Q., Model of artificial neural network for quantitative structure-retention relations of saturated alcohols, J. Southwest Univ. (Nat. Sci. Edn.), 2007, 33, 6, 1369-1372. [all data]