4H-Dibenz[a,kl]anthracene

Phase change data

Data compiled by: Thermodynamics Research Center, NIST Boulder Laboratories, Chris Muzny director

Quantity Value Units Method Reference Comment
Tfus411.4KN/AFieser and Seligman, 1936Uncertainty assigned by TRC = 2. K

In addition to the Thermodynamics Research Center (TRC) data available from this site, much more physical and chemical property data is available from the following TRC products:

References

Fieser and Seligman, 1936
Fieser, L.F.; Seligman, A.M., The Pyrolysis of Tetralyl Naphthyl Ketones, J. Am. Chem. Soc., 1936, 58, 478-80. [all data]