Hexanal, 3-methyl-

Normal alkane RI, polar column, custom temperature program

View large format table.

Column type Active phase I Reference Comment
CapillarySupelcowax-101116.Kourkoutas, Bosnea, et al., 200660. m/0.32 mm/0.25 μm, He; Program: 35C(3min) => 5C/min => 110C => 10C/min => 240C (10min)

Phase change data

Data compiled by: William E. Acree, Jr., James S. Chickos

Enthalpy of vaporization

ΔvapH (kJ/mol) Temperature (K) Method Reference Comment
42.8329.EBMills and Fenton, 1987Based on data from 314. - 417. K.

References

Kourkoutas, Bosnea, et al., 2006
Kourkoutas, Y.; Bosnea, L.; Taboukos, S.; Baras, C.; Lambrou, D.; Kanellaki, M., Probiotic Cheese Production Using Lactobacillus casei Cells Immobilized on Fruit Pieces, J. Dairy Sci., 2006, 89, 5, 1439-1451, https://doi.org/10.3168/jds.S0022-0302(06)72212-3 . [all data]