3,4-Diiodothiophene

Gas phase ion energetics data

Data compiled as indicated in comments:
LLK - Sharon G. Lias, Rhoda D. Levin, and Sherif A. Kafafi

Ionization energy determinations

IE (eV) Method Reference Comment
8.45PEBozic, Humski, et al., 1977Vertical value; LLK

References

Bozic, Humski, et al., 1977
Bozic, Z.; Humski, K.; Cvitas, T.; Klasinc, L., Photoelectron spectra of bromo- and iodo- thiophens, J. Chem. Soc. Perkin Trans. 2, 1977, 1413. [all data]