4,5,6,7-Tetrafluorobenzo-2,1,3-selenazole

Gas phase ion energetics data

Data compiled by: Sharon G. Lias and Joel F. Liebman

Ionization energy determinations

IE (eV) Method Reference Comment
9.28PEPetrachenko, Vovna, et al., 1991Vertical value

References

Petrachenko, Vovna, et al., 1991
Petrachenko, N.W.; Vovna, V.I.; Zibarev, A.V.; Furin, G.G., Aryleneazachalcogenenes. 2. Photoelectron spectra and electron structures of benzo-2,1,3-thia- and -selenadiazoles and their perfluoro derivatives, Khim. Geterotsikl. Soedin., 1991, 4, 563. [all data]