Tetracyclopropylsuccinonitrile

Condensed phase thermochemistry data

Data compiled as indicated in comments:
ALS - Hussein Y. Afeefy, Joel F. Liebman, and Stephen E. Stein
DH - Eugene S. Domalski and Elizabeth D. Hearing

Quantity Value Units Method Reference Comment
Δfsolid427. ± 3.kJ/molCcbBernloehr, Beckhaus, et al., 1984Uc =-9518.3±2.7 cal/g; ALS

Constant pressure heat capacity of solid

Cp,solid (J/mol*K) Temperature (K) Reference Comment
321.8298.15Bernloehr, Beckhaus, et al., 1984DH

References

Bernloehr, Beckhaus, et al., 1984
Bernloehr, w.; Beckhaus, H.D.; Ruechardt, C., Substituent effects on carbon-carbon bond strength. 6. Tetracyclopropylsuccinonitrile, Chem. Ber., 1984, 117, 1026-1033. [all data]