2,2',4,4',6,6'-hexanitroazobenzene

Condensed phase thermochemistry data

Data compiled by: Hussein Y. Afeefy, Joel F. Liebman, and Stephen E. Stein

Quantity Value Units Method Reference Comment
Δfsolid290. ± 5.4kJ/molCcbRouse, 1976Author was aware that data differs from previously reported values
Δfsolid242.kJ/molCcbFedoroff and Shefield, 1975
Δfsolid255.6 ± 1.1kJ/molCcrBaroody and Carpenter, 1973
Quantity Value Units Method Reference Comment
Δcsolid-5584. ± 2.kJ/molCcbRouse, 1976Author was aware that data differs from previously reported values
Δcsolid-5549.4 ± 1.1kJ/molCcrBaroody and Carpenter, 1973

References

Rouse, 1976
Rouse, P.E., Jr., Enthalpies of formation and calculated detonation properties of some thermally stable explosives, J. Chem. Eng. Data, 1976, 21, 16-20. [all data]

Fedoroff and Shefield, 1975
Fedoroff, B.T.; Shefield, O.E., Table 1. Standard heats of formation and heats of detonation of common explosives in Encyclopedia of Explosives and Related Items, Part 2700 Volume 7, Picatinny Arsenal, Dover, NJ., 1975, 41-42. [all data]

Baroody and Carpenter, 1973
Baroody, E.E.; Carpenter, G.A., Enthalpies of formation of some fluorodinitroethyl derivatives and 2,2',4,4',6,6'-hexanitroazobenzene, J. Chem. Eng. Data, 1973, 18, 28-36. [all data]