1,3-Dioxane, 2,4,6-trimethyl-, (2α,4α,6α)-

Gas phase ion energetics data

Data compiled by: Sharon G. Lias, Rhoda D. Levin, and Sherif A. Kafafi

Appearance energy determinations

Ion AE (eV) Other Products MethodReferenceComment
C6H11O2+9.593 ± 0.006CH3EIPihlaja and Jalonen, 1971

References

Pihlaja and Jalonen, 1971
Pihlaja, K.; Jalonen, J., Appearance potentials determined by the electron-impact method as an analytical aid in the evaluation of conformational energies and clarification of ring conformation-I: Appearance potentials of the [M-R]+ ions formed in the primary fragmentation of stereoisomeric 1,3-dioxans. A direct route to conformational energies, Org. Mass Spectrom., 1971, 5, 1363. [all data]