Benzene, 1,1',1''-(1-propanyl-3-ylidene)tris-

Phase change data

Data compiled by: Thermodynamics Research Center, NIST Boulder Laboratories, Chris Muzny director

Quantity Value Units Method Reference Comment
Tfus320.KN/AHauser and Hamrick, 1957Uncertainty assigned by TRC = 2. K

In addition to the Thermodynamics Research Center (TRC) data available from this site, much more physical and chemical property data is available from the following TRC products:

References

Hauser and Hamrick, 1957
Hauser, C.R.; Hamrick, P.J., Alkylation of Diphenylmethane with ALkyl Halides by Sodium Amide. Substitution versus β-Elimination. Relative Acidities of Diphenylmethane and Ammonia, J. Am. Chem. Soc., 1957, 79, 3142. [all data]