Aluminum iodide

Gas phase thermochemistry data

Quantity Value Units Method Reference Comment
Δfgas-489.53kJ/molReviewChase, 1998Data last reviewed in September, 1979
Quantity Value Units Method Reference Comment
gas,1 bar597.36J/mol*KReviewChase, 1998Data last reviewed in September, 1979

Gas Phase Heat Capacity (Shomate Equation)

Cp° = A + B*t + C*t2 + D*t3 + E/t2
H° − H°298.15= A*t + B*t2/2 + C*t3/3 + D*t4/4 − E/t + F − H
S° = A*ln(t) + B*t + C*t2/2 + D*t3/3 − E/(2*t2) + G
    Cp = heat capacity (J/mol*K)
    H° = standard enthalpy (kJ/mol)
    S° = standard entropy (J/mol*K)
    t = temperature (K) / 1000.

View plot Requires a JavaScript / HTML 5 canvas capable browser.

View table.

Temperature (K) 298. - 6000.
A 182.3186
B 0.512293
C -0.139033
D 0.011876
E -0.943308
F -547.0706
G 812.5412
H -489.5280
ReferenceChase, 1998
Comment Data last reviewed in September, 1979

References

Chase, 1998
Chase, M.W., Jr., NIST-JANAF Themochemical Tables, Fourth Edition, J. Phys. Chem. Ref. Data, Monograph 9, 1998, 1-1951. [all data]