Estriol, 3TMS derivative

Van Den Dool and Kratz RI, non-polar column, custom temperature program

Data compiled by: NIST Mass Spectrometry Data Center, William E. Wallace, director

Column type Capillary
Active phase VF-5MS
Column length (m) 30.
Carrier gas He
Substrate
Column diameter (mm) 0.25
Phase thickness (μm) 0.25
Program Multi-step temperature program; T(initial)=60C; T(final)=270C
I 2918.7
ReferenceTret'yakov, 2007
Comment MSDC-RI

Normal alkane RI, non-polar column, temperature ramp

Data compiled by: NIST Mass Spectrometry Data Center, William E. Wallace, director

Column type PackedCapillaryCapillary
Active phase SE-30SE-30SE-30
Column length (m) 2.20.20.
Carrier gas N2
Substrate Gas Chrom Q
Column diameter (mm)  0.250.25
Phase thickness (μm)  0.330.33
Tstart (C) 150.200.200.
Tend (C) 300.250.250.
Heat rate (K/min) 4.1.32.2
Initial hold (min)   10.
Final hold (min)
I 2889.2865.2874.
ReferenceHarvey, 1980Fels, Dehennin, et al., 1975Fels, Dehennin, et al., 1975
Comment MSDC-RI MSDC-RI MSDC-RI

References

Tret'yakov, 2007
Tret'yakov, K.V., Retention Data. NIST Mass Spectrometry Data Center., NIST Mass Spectrometry Data Center, 2007. [all data]