5β-Pregnan-3α-ol-20-one, TMS derivative

Normal alkane RI, non-polar column, custom temperature program

View large format table.

Column type Active phase I Reference Comment
CapillaryMethyl Silicone2637.Meng, Reyes, et al., 1997Program: not specified
CapillaryMethyl Silicone2637.Meng and Sjövall, 199725. m/0.32 mm/0.25 μm; Program: 60 0C 30 K/min -> 210 0C (1.5 min) 2.5 K/min -> 320 0C (20 min)

References

Meng, Reyes, et al., 1997
Meng, L.-J.; Reyes, H.; Palma, J.; Hernandez, I.; Ribalta, J.; Sjövall, J., Profiles of bile acids and progesterone metabolites in the urine and serum of women with intrahepatic cholestasis of pregnancy, J. Hepatol., 1997, 27, 2, 346-357, https://doi.org/10.1016/S0168-8278(97)80181-X . [all data]

Meng and Sjövall, 1997
Meng, L.-J.; Sjövall, J., Method for combined analysis of profiles of conjugated progesterone metabolites and bile acids in serum and urine of pregnant women, J. Chromatogr. B, 1997, 688, 1, 11-26, https://doi.org/10.1016/S0378-4347(97)88051-6 . [all data]