Norfenfluramine

Kovats' RI, non-polar column, isothermal

Data compiled by: NIST Mass Spectrometry Data Center, William E. Wallace, director

Column type PackedPackedPacked
Active phase OV-101Apiezon LApiezon L
Column length (m) 2.
Carrier gas N2
Substrate   Chromosorb W
Column diameter (mm)
Phase thickness (μm)
Temperature (C) 120.120.120.
I 1136.1092.1092.
ReferenceHuber, Kenndler, et al., 1979Huber, Kenndler, et al., 1979Donike and Stratmann, 1976
Comment MSDC-RI MSDC-RI MSDC-RI

Kovats' RI, polar column, isothermal

View large format table.

Column type Active phase Temperature (C) I Reference Comment
PackedPEG-20M115.1560.Huber, Kenndler, et al., 1979N2
PackedPEG-20M115.1560.Donike and Stratmann, 1976Chromosorb W

Normal alkane RI, non-polar column, isothermal

View large format table.

Column type Active phase Temperature (C) I Reference Comment
CapillaryApieson L / KOH150.1078.Caddy, Fish, et al., 1973
CapillaryApieson L / KOH150.1096.Caddy, Fish, et al., 1973
CapillaryApieson L / KOH150.1098.Caddy, Fish, et al., 1973

Normal alkane RI, non-polar column, custom temperature program

View large format table.

Column type Active phase I Reference Comment
OtherMethyl Silicone1133.Ardrey and Moffat, 1981Program: not specified

Normal alkane RI, polar column, isothermal

View large format table.

Column type Active phase Temperature (C) I Reference Comment
CapillaryCarbowax 20M / KOH150.1600.Caddy, Fish, et al., 1973
CapillaryCarbowax 20M / KOH150.1608.Caddy, Fish, et al., 1973
CapillaryCarbowax 20M / KOH150.1616.Caddy, Fish, et al., 1973

References

Huber, Kenndler, et al., 1979
Huber, J.F.K.; Kenndler, E.; Reich, G., Quantitation of the Information Content of Multi-Dimensional Gas Chromatography and Low- Resolution Mass Spectrometry in the Identification of Doping Drugs, J. Chromatogr., 1979, 172, 1, 15-30, https://doi.org/10.1016/S0021-9673(00)90941-5 . [all data]

Donike and Stratmann, 1976
Donike, M.; Stratmann, D., Gas-chromatographische identifizierung von stimulantien der phenyläthylaminreihe mit hilfe der retnetions-indices, Z. Anal. Chem., 1976, 279, 2, 129-131, https://doi.org/10.1007/BF00440798 . [all data]