1-Butoxy-2-propoxyethane

Phase change data

Data compiled as indicated in comments:
ALS - Hussein Y. Afeefy, Joel F. Liebman, and Stephen E. Stein
AC - William E. Acree, Jr., James S. Chickos

Quantity Value Units Method Reference Comment
Δvap54.68 ± 0.08kJ/molCKusano and Wads, 1970ALS
Δvap54.7 ± 0.1kJ/molCKusano and Wadso, 1970AC

References

Kusano and Wads, 1970
Kusano, K.; Wads, I., Enthalpies of vaporization of organic compounds, Acta Chem. Scand., 1970, 24, 2037. [all data]

Kusano and Wadso, 1970
Kusano, K.; Wadso, I., Enthalpies of vaporization of organic compounds, Acta Chem. Scand., 1970, 24, 2037-2042. [all data]