1-Tricosene

Van Den Dool and Kratz RI, non-polar column, custom temperature program

View large format table.

Column type Active phase I Reference Comment
CapillaryDB-52296.Zaikin and Borisov, 2002He; Column length: 30. m; Column diameter: 0.25 mm; Program: 30C => 5K/min=120C => 10C/min => 270C

Normal alkane RI, non-polar column, temperature ramp

View large format table.

Column type Active phase I Reference Comment
CapillaryHP-5 MS2294.Radulovic, Blagojevic, et al., 201030. m/0.25 mm/0.25 μm, Helium, 5. K/min, 290. C @ 10. min; Tstart: 70. C
CapillaryDB-52289.Senatore, Landolfi, et al., 200630. m/0.25 mm/0.25 μm, He, 40. C @ 5. min, 2. K/min, 260. C @ 20. min
CapillaryPetrocol DH2293.Sojak, Kubinec, et al., 2006150. m/0.25 mm/1.0 μm, 1. K/min; Tstart: 40. C; Tend: 300. C
CapillaryHP-52294.Utsunomia, Kawata, et al., 200530. m/0.32 mm/0.25 μm, Helium, 4. K/min, 300. C @ 5. min; Tstart: 40. C
CapillaryOV-12288.Ramaroson-Raonizafinimanana, Gaydou, et al., 199725. m/0.31 mm/0.15 μm, H2, 3. K/min; Tstart: 70. C; Tend: 220. C
CapillarySE-542295.Scribe, Ngoumbi-Nzouzi, et al., 19902. K/min; Column length: 25. m; Column diameter: 0.32 mm; Tstart: 100. C; Tend: 280. C
CapillaryCP Sil 8 CB2290.Yruela, Barbe, et al., 199025. m/0.20 mm/0.13 μm, H2, 6. K/min; Tstart: 60. C; Tend: 300. C

Normal alkane RI, non-polar column, custom temperature program

View large format table.

Column type Active phase I Reference Comment
CapillaryDB-52275.Menzel, Bluthgen, et al., 200830. m/0.25 mm/0.25 μm, Helium; Program: 60 0C (2 min) 60 0C/min -> 200 0C 4 0C/min -> 320 0C (10 min)

Phase change data

Data compiled by: William E. Acree, Jr., James S. Chickos

Enthalpy of vaporization

ΔvapH (kJ/mol) Temperature (K) Reference Comment
98.5424.Dykyj, Svoboda, et al., 1999Based on data from 409. - 652. K.

References

Zaikin and Borisov, 2002
Zaikin, V.G.; Borisov, R.S., Chromatographic-mass spectrometric analysis of Fishcer-Tropsch synthesis products, J. Anal. Chem. USSR (Engl. Transl.), 2002, 57, 6, 544-551. [all data]

Radulovic, Blagojevic, et al., 2010
Radulovic, N.; Blagojevic, P.; Palic, R., Comparative study of the leaf volatiles of Arctostaphylos uva-ursi (L.) Spreng. and Vaccinium vitis-idaea L. (Ericaceae), Molecules, 2010, 15, 9, 6168-6185, https://doi.org/10.3390/molecules15096168 . [all data]

Senatore, Landolfi, et al., 2006
Senatore, F.; Landolfi, S.; Celik, S.; Bruno, M., Volatile components of Centaurea calcitrapa L. and Centaurea sphaerocephala L. ssp. sphaerocephala, two Asteraceae growing wild in Sicily, Flavour Fragr. J., 2006, 21, 2, 282-285, https://doi.org/10.1002/ffj.1585 . [all data]

Sojak, Kubinec, et al., 2006
Sojak, L.; Kubinec, R.; Jurdakova, H.; Hajekova, E.; Bajus, M., GC-MS of polyethylene and polypropylene thermal cracking produxts, Petroleum Coal, 2006, 48, 1, 1-14. [all data]

Utsunomia, Kawata, et al., 2005
Utsunomia, H.; Kawata, J.; Chanoki, W.; Shirakawa, N.; Miyazawa, M., Components of Essential Oil from Woods of Prunus mume Sieb. at Zucc., J. Oleo Sci., 2005, 54, 11, 609-612, https://doi.org/10.5650/jos.54.609 . [all data]

Ramaroson-Raonizafinimanana, Gaydou, et al., 1997
Ramaroson-Raonizafinimanana, B.; Gaydou, E.M.; Bombarda, I., Hydrocarbons from three vanilla bean species: V. fragrans, V. madagascariensis, and V. tahitensis, J. Agric. Food Chem., 1997, 45, 7, 2542-2545, https://doi.org/10.1021/jf960927b . [all data]

Scribe, Ngoumbi-Nzouzi, et al., 1990
Scribe, P.; Ngoumbi-Nzouzi, J.-S.; Fuché, C.; Pèpe, C.; Saliot, A., Biogeochemistry of organic matter in Lake Geneva: I. Particulate hydrocarbons as biogenic and anthropogenic molecular markers, Hydrobiologia, 1990, 207, 1, 319-331, https://doi.org/10.1007/BF00041471 . [all data]

Yruela, Barbe, et al., 1990
Yruela, I.; Barbe, A.; Grimalt, J.O., Determination of Double Bond Position and Geometry in Linear and High Branched Hydrocarbons and Fatty Acids from Gas Chromatography-Mass Spectrometry of Epoxides and Diols Generated by Stereospecific Resin Hydration, J. Chromatogr. Sci., 1990, 28, 8, 421-427, https://doi.org/10.1093/chromsci/28.8.421 . [all data]

Menzel, Bluthgen, et al., 2008
Menzel, F.; Bluthgen, N.; Schmitt, T., Tropical parabiotic ants: Highly unusual cuticular substances and low interspecific discrimination, Frontiers in Zoology, 2008, 5, 16, 1-16. [all data]