Anthracene, 2-(1,1-dimethylethyl)-

Gas phase ion energetics data

Data compiled by: John E. Bartmess

Electron affinity determinations

EA (eV) Method Reference Comment
0.500 ± 0.060LPESAndo, Mitsui, et al., 2007

References

Ando, Mitsui, et al., 2007
Ando, N.; Mitsui, M.; Nakajima, A., Comprehensive photoelectron spectroscopic study of anionic clusters of anthracene and its alkyl derivatives: Electronic structures bridging molecules to bulk, J. Chem. Phys., 2007, 127, 23, 234305, https://doi.org/10.1063/1.2805185 . [all data]